Skip site navigation (1) Skip section navigation (2)

Re: pgsql: Added just another test case.

From: Tom Lane <tgl(at)sss(dot)pgh(dot)pa(dot)us>
To: meskes(at)postgresql(dot)org (Michael Meskes)
Cc: pgsql-committers(at)postgresql(dot)org
Subject: Re: pgsql: Added just another test case.
Date: 2006-02-08 15:45:03
Message-ID: (view raw, whole thread or download thread mbox)
Lists: pgsql-committers
meskes(at)postgresql(dot)org (Michael Meskes) writes:
> Log Message:
> -----------
>  Added just another test case.
>  Fixed missing continuation line character.
>  Do not translate $-quoting.
>  Bit field notation belongs to a variable not a variable list.
>  Output of line number only done by one function.

This commit seems to have broken HEAD:

bison -y -d  preproc.y
mv -f ./preproc.c
mv -f ./preproc.h
/usr/bin/flex  -o'pgc.c' pgc.l
ccache gcc -O2 -Wall -Wmissing-prototypes -Wpointer-arith -Winline -Wdeclaration-after-statement -Wendif-labels -fno-strict-aliasing -g -Wno-error -pthread  -D_REENTRANT -D_THREAD_SAFE -D_POSIX_PTHREAD_SEMANTICS -I./../include -I. -I../../../../src/include -D_GNU_SOURCE  -I/usr/include/et -DMAJOR_VERSION=4 -DMINOR_VERSION=2 -DPATCHLEVEL=1  -c -o preproc.o preproc.c
In file included from preproc.y:6614:
pgc.c: In function `yylex':
pgc.c:1522: warning: label `find_rule' defined but not used
preproc.y: At top level:
pgc.c:3678: warning: 'yy_flex_realloc' defined but not used
ccache gcc -O2 -Wall -Wmissing-prototypes -Wpointer-arith -Winline -Wdeclaration-after-statement -Wendif-labels -fno-strict-aliasing -g -Wno-error -pthread  -D_REENTRANT -D_THREAD_SAFE -D_POSIX_PTHREAD_SEMANTICS -I./../include -I. -I../../../../src/include -D_GNU_SOURCE  -I/usr/include/et -DMAJOR_VERSION=4 -DMINOR_VERSION=2 -DPATCHLEVEL=1  -c -o type.o type.c
ccache gcc -O2 -Wall -Wmissing-prototypes -Wpointer-arith -Winline -Wdeclaration-after-statement -Wendif-labels -fno-strict-aliasing -g -Wno-error -pthread  -D_REENTRANT -D_THREAD_SAFE -D_POSIX_PTHREAD_SEMANTICS -I./../include -I. -I../../../../src/include -D_GNU_SOURCE  -I/usr/include/et -DMAJOR_VERSION=4 -DMINOR_VERSION=2 -DPATCHLEVEL=1  -c -o ecpg.o ecpg.c
ccache gcc -O2 -Wall -Wmissing-prototypes -Wpointer-arith -Winline -Wdeclaration-after-statement -Wendif-labels -fno-strict-aliasing -g -Wno-error -pthread  -D_REENTRANT -D_THREAD_SAFE -D_POSIX_PTHREAD_SEMANTICS -I./../include -I. -I../../../../src/include -D_GNU_SOURCE  -I/usr/include/et -DMAJOR_VERSION=4 -DMINOR_VERSION=2 -DPATCHLEVEL=1  -c -o ecpg_keywords.o ecpg_keywords.c
ccache gcc -O2 -Wall -Wmissing-prototypes -Wpointer-arith -Winline -Wdeclaration-after-statement -Wendif-labels -fno-strict-aliasing -g -Wno-error -pthread  -D_REENTRANT -D_THREAD_SAFE -D_POSIX_PTHREAD_SEMANTICS -I./../include -I. -I../../../../src/include -D_GNU_SOURCE  -I/usr/include/et -DMAJOR_VERSION=4 -DMINOR_VERSION=2 -DPATCHLEVEL=1  -c -o output.o output.c
output.c: In function `hashline_number':
output.c:90: error: `yydebug' undeclared (first use in this function)
output.c:90: error: (Each undeclared identifier is reported only once
output.c:90: error: for each function it appears in.)
make[4]: *** [output.o] Error 1

			regards, tom lane

In response to


pgsql-committers by date

Next:From: Bruce MomjianDate: 2006-02-08 15:45:58
Subject: Re: pgsql: Added just another test case.
Previous:From: User FxjrDate: 2006-02-08 13:57:28
Subject: npgsql - Npgsql: 2006-02-08 Francisco Figueiredo Jr.

Privacy Policy | About PostgreSQL
Copyright © 1996-2017 The PostgreSQL Global Development Group