Skip site navigation (1) Skip section navigation (2)

Re: [pgadmin-support] pgAdmin3 doesn't work after upgrading FC1 to

From: Devrim GUNDUZ <devrim(at)gunduz(dot)org>
To: Dave Page <dpage(at)vale-housing(dot)co(dot)uk>
Cc: pgadmin-hackers(at)postgresql(dot)org, <pgadmin-support(at)postgresql(dot)org>
Subject: Re: [pgadmin-support] pgAdmin3 doesn't work after upgrading FC1 to
Date: 2004-06-10 12:05:47
Message-ID: Pine.LNX.4.44.0406101246310.11293-100000@emo.org.tr (view raw or flat)
Thread:
Lists: pgadmin-hackerspgadmin-support
Hi,

On Thu, 10 Jun 2004, Dave Page wrote:

> > I upgraded Fedora Core 1 to Fedora Core 2 and pgAdmin3 
> > doesn't work any more. When launched on the terminal, the error is:
> > "pgadmin3: error while loading shared libraries: pgadmin3: undefined
> > symbol: _gtk_accel_group_attach"
> > 
> > Thanks for any help.
> > 
> > (version is pgadmin3-1.1.0-cvs20031211)
> 
> The GTK libraries have changed in FC2, requiring a different build of
> pgAdmin (which none of us provide yet).

I got the same error while building the rpm:

===================================================================
g++ -DDATA_DIR=\"/usr/share/pgadmin3/\" -Wall -g -I../src/include 
-I../src/agent/include -Wall -g -O0  -L/usr/lib -L/usr/lib -o pgadmin3  
pgAdmin3.o pgConn.o pgSet.o keywords.o pgAggregate.o pgCast.o pgCheck.o 
pgCollection.o pgColumn.o pgConstraints.o pgConversion.o pgDatabase.o 
pgDomain.o pgForeignKey.o pgFunction.o pgGroup.o pgIndex.o 
pgIndexConstraint.o pgLanguage.o pgObject.o pgOperator.o pgOperatorClass.o 
pgRule.o pgSchema.o pgSequence.o pgServer.o pgTable.o pgTrigger.o pgType.o 
pgUser.o pgView.o pgDatatype.o pgaAgent.o pgaJob.o pgaStep.o pgaSchedule.o 
dlgJob.o dlgSchedule.o dlgStep.o xh_sqlbox.o xh_calb.o xh_timespin.o 
calbox.o timespin.o ctlListView.o ctlSQLBox.o ctlSQLResult.o frmExport.o 
dlgAddTableView.o dlgEditGridOptions.o events.o frmAbout.o frmIndexcheck.o 
frmChildTableViewFrame.o frmConnect.o frmMain.o frmOptions.o frmPassword.o 
frmQuery.o frmQueryBuilder.o frmHelp.o frmQBJoin.o frmSplash.o 
frmMaintenance.o frmEditGrid.o dlgProperty.o dlgUser.o dlgGroup.o 
dlgDatabase.o dlgLanguage.o dlgSchema.o dlgDomain.o dlgTable.o dlgColumn.o 
dlgIndex.o dlgFunction.o dlgView.o dlgRule.o dlgOperator.o dlgAggregate.o 
dlgCast.o dlgConversion.o dlgIndexConstraint.o dlgForeignKey.o 
dlgSequence.o dlgTrigger.o dlgType.o dlgCheck.o frmStatus.o misc.o 
sysLogger.o sysSettings.o utffile.o xrcDialogs.o  /usr/lib/libpq.a -lcrypt  
-lssl -lcrypto /usr/lib/libwx_gtk2ud_stc-2.5.a 
/usr/lib/libwx_gtk2ud_xrc-2.5.a  -pthread      /usr/lib/libwx_gtk2ud-2.5.a 
-Wl,--export-dynamic -pthread -lgtk-x11-2.0 -lgdk-x11-2.0 -latk-1.0 
-lgdk_pixbuf-2.0 -lm -lpangoxft-1.0 -lpangox-1.0 -lpango-1.0 -lgobject-2.0 
-lgmodule-2.0 -ldl -lgthread-2.0 -lglib-2.0 -Wl,--export-dynamic 
-lpangoft2-1.0 -lpango-1.0 -lgobject-2.0 -lgmodule-2.0 -ldl -lglib-2.0 
-lpng -ljpeg -ltiff -lz -ldl -lm
/usr/lib/libwx_gtk2ud-2.5.a(monolib_settings.o)(.text+0x930): In function 
`wxSystemSettingsNative::GetFont(wxSystemFont)':
: undefined reference to `_gtk_rc_context_get_default_font_name'
/usr/lib/libwx_gtk2ud-2.5.a(monolib_menu.o)(.text+0xbdd): In function 
`wxMenubarUnsetInvokingWindow(wxMenu*, wxWindow*)':
: undefined reference to `_gtk_accel_group_detach'
/usr/lib/libwx_gtk2ud-2.5.a(monolib_menu.o)(.text+0xcd9): In function 
`wxMenubarSetInvokingWindow(wxMenu*, wxWindow*)':
: undefined reference to `_gtk_accel_group_attach'
/usr/lib/libwx_gtk2ud-2.5.a(monolib_menu.o)(.text+0xd8e): In function 
`wxMenuBar::SetInvokingWindow(wxWindow*)':
: undefined reference to `_gtk_accel_group_attach'
/usr/lib/libwx_gtk2ud-2.5.a(monolib_menu.o)(.text+0xe00): In function 
`wxMenuBar::UnsetInvokingWindow(wxWindow*)':
: undefined reference to `_gtk_accel_group_detach'
collect2: ld returned 1 exit status
make[2]: *** [pgadmin3] Error 1
make[2]: Leaving directory `/usr/src/redhat/BUILD/pgadmin3-1.1.0/src'
make[1]: *** [all-recursive] Error 1
make[1]: Leaving directory `/usr/src/redhat/BUILD/pgadmin3-1.1.0'
make: *** [all] Error 2
error: Bad exit status from /var/tmp/rpm-tmp.56985 (%build)
 
RPM build errors:
    Bad exit status from /var/tmp/rpm-tmp.56985 (%build)
====================================================================== 


-- 
Devrim GUNDUZ	       
devrim~gunduz.org				devrim.gunduz~linux.org.tr 
			http://www.tdmsoft.com
			http://www.gunduz.org




In response to

Responses

pgadmin-hackers by date

Next:From: Adam H. PendletonDate: 2004-06-10 17:12:26
Subject: Re: [pgadmin-support] pgAdmin3 doesn't work after
Previous:From: Devrim GUNDUZDate: 2004-06-10 09:24:12
Subject: Re: pgAdmin3 doesn't work after upgrading FC1 to

pgadmin-support by date

Next:From: Chris GamacheDate: 2004-06-10 14:06:56
Subject: SQL Query and SET commands
Previous:From: Devrim GUNDUZDate: 2004-06-10 09:24:12
Subject: Re: pgAdmin3 doesn't work after upgrading FC1 to

Privacy Policy | About PostgreSQL
Copyright © 1996-2014 The PostgreSQL Global Development Group