Skip site navigation (1) Skip section navigation (2)

OS X compile error

From: Patrick Hatcher <PHatcher(at)macys(dot)com>
To: pgadmin-support(at)postgresql(dot)org
Subject: OS X compile error
Date: 2004-11-09 18:27:05
Message-ID: OF53052E57.3FCEEAD5-ON88256F47.00653CF9-88256F47.00669A14@fds.com (view raw or flat)
Thread:
Lists: pgadmin-support
Trying to compile code from the CVS and I receive this error:

ld: Undefined symbols:
ctlComboBox::GetStringSelection() const
make[2]: *** [pgadmin3] Error 1
make[1]: *** [all-recursive] Error 1
make: *** [all] Error 2

Any clues?
TIA


Patrick Hatcher
Macys.Com

Responses

pgadmin-support by date

Next:From: stig eriksonDate: 2004-11-09 18:37:49
Subject: pgadmin3 1.2.0 rc1 windows
Previous:From: Andreas PflugDate: 2004-11-09 16:13:18
Subject: Re: Database /properties/variables problem.

Privacy Policy | About PostgreSQL
Copyright © 1996-2014 The PostgreSQL Global Development Group