Skip site navigation (1) Skip section navigation (2)

Re: cron: sh /usr/local/src/pgadmin3/pkg/src/build-tarball;sh /usr/local/src/pgadmin3/pkg/slackware/build-snapshot 91

From: "Dave Page" <dpage(at)vale-housing(dot)co(dot)uk>
To: "Andreas Pflug" <pgadmin(at)pse-consulting(dot)de>
Cc: <pgadmin-hackers(at)postgresql(dot)org>
Subject: Re: cron: sh /usr/local/src/pgadmin3/pkg/src/build-tarball;sh /usr/local/src/pgadmin3/pkg/slackware/build-snapshot 91
Date: 2005-02-24 13:47:07
Message-ID: E7F85A1B5FF8D44C8A1AF6885BC9A0E472B705@ratbert.vale-housing.co.uk (view raw or flat)
Thread:
Lists: pgadmin-hackers
 

> -----Original Message-----
> From: Andreas Pflug [mailto:pgadmin(at)pse-consulting(dot)de] 
> Sent: 24 February 2005 12:30
> To: Dave Page
> Cc: pgadmin-hackers(at)postgresql(dot)org
> Subject: Re: cron: sh 
> /usr/local/src/pgadmin3/pkg/src/build-tarball;sh 
> /usr/local/src/pgadmin3/pkg/slackware/build-snapshot 91
> 
> The former SetIncludeList is deprecated for 2.5.4, apparently 
> it's not 
> present in 2.5.3; I wasn't aware of that when I committed it to CVS.

OK - updated to 2.5.4, and following a 'make distclean' now get:

if g++ -DHAVE_CONFIG_H -I. -I. -I..
-DDATA_DIR=\"/usr/local/pgadmin3/share/pgadmin3/\" -Wall -g
-I../src/include -I../src/agent/include -I../src/slony/include
-I/usr/local/pgsql/include -DSSL
-I/usr/local/lib/wx/include/gtk2-unicode-debug-static-2.5
-I/usr/local/include/wx-2.5 -D__WXDEBUG__ -D__WXGTK__
-D_FILE_OFFSET_BITS=64 -D_LARGE_FILES -D_LARGEFILE_SOURCE=1
-I/usr/local/include/wx-2.5
-DDATA_DIR=\"/usr/local/pgadmin3/share/pgadmin3/\" -Wall -g
-I../src/include -I../src/agent/include -I../src/slony/include -Wall -g
-O0 -MT slNode.o -MD -MP -MF ".deps/slNode.Tpo" \
  -c -o slNode.o `test -f './slony/slNode.cpp' || echo
'./'`./slony/slNode.cpp; \
then mv -f ".deps/slNode.Tpo" ".deps/slNode.Po"; \
else rm -f ".deps/slNode.Tpo"; exit 1; \
fi
slony/slNode.cpp: In member function `virtual void
   slNode::ShowStatistics(frmMain*, ctlListView*)':
slony/slNode.cpp:83: syntax error before `)' token
slony/slNode.cpp: At global scope:
slony/slNode.cpp:102: syntax error before `else'
slony/slNode.cpp:116: `stats' was not declared in this scope
slony/slNode.cpp:118: syntax error before `->' token
slony/slNode.cpp:119: syntax error before `->' token
slony/slNode.cpp:120: syntax error before `->' token
slony/slNode.cpp:121: syntax error before `->' token
slony/slNode.cpp:122: syntax error before `->' token
slony/slNode.cpp:127: syntax error before `->' token
make[2]: *** [slNode.o] Error 1
make[2]: Leaving directory `/usr/local/src/pgadmin3/src'
make[1]: *** [all-recursive] Error 1
make[1]: Leaving directory `/usr/local/src/pgadmin3'
make: *** [all] Error 2

Regards, Dave

Responses

pgadmin-hackers by date

Next:From: Hiroshi SaitoDate: 2005-02-24 14:07:57
Subject: Re: utffile patch
Previous:From: Andreas PflugDate: 2005-02-24 12:29:53
Subject: Re: cron: sh /usr/local/src/pgadmin3/pkg/src/build-tarball;sh /usr/local/src/pgadmin3/pkg/slackware/build-snapshot

Privacy Policy | About PostgreSQL
Copyright © 1996-2014 The PostgreSQL Global Development Group