Skip site navigation (1) Skip section navigation (2)

review of: collation for (expr)

From: probabble <probabble(at)gmail(dot)com>
To: pgsql-hackers(at)postgresql(dot)org
Subject: review of: collation for (expr)
Date: 2012-01-13 05:25:56
Message-ID: CAGXNmBFZzUqfp0nsAufJMP=+XTg+NKA4TiPoxfbJBUgptax+3Q@mail.gmail.com (view raw or flat)
Thread:
Lists: pgsql-hackers
Compiling on Ubuntu 10.04 LTS AMD64 on a GoGrid virtual machine from
2012-01-12 checkout.

Bison upgraded to v2.5, and downgraded to v2.4.1

Make process for both versions resulted in the following errors:

make[3]: Leaving directory `/usr/local/src/pgbuild/src/backend/catalog'
make -C parser gram.h
make[3]: Entering directory `/usr/local/src/pgbuild/src/backend/parser'
/usr/local/bin/bison -d  -o gram.c gram.y
gram.y: conflicts: 370 reduce/reduce
gram.y: expected 0 reduce/reduce conflicts
gram.y:10482.27-10494.33: warning: rule useless in parser due to conflicts:
func_expr: COLLATION FOR '(' a_expr ')'
make[3]: *** [gram.c] Error 1
make[3]: Leaving directory `/usr/local/src/pgbuild/src/backend/parser'
make[2]: *** [parser/gram.h] Error 2
make[2]: Leaving directory `/usr/local/src/pgbuild/src/backend'
make[1]: *** [all-backend-recurse] Error 2
make[1]: Leaving directory `/usr/local/src/pgbuild/src'
make: *** [all-src-recurse] Error 2

Responses

pgsql-hackers by date

Next:From: Hitoshi HaradaDate: 2012-01-13 05:31:13
Subject: Re: reprise: pretty print viewdefs
Previous:From: Linh NguyenDate: 2012-01-13 04:46:57
Subject: Patch: DROP INDEX CONCURRENTLY partially reviewed

Privacy Policy | About PostgreSQL
Copyright © 1996-2014 The PostgreSQL Global Development Group