Skip site navigation (1) Skip section navigation (2)

BUG #1235: didn't compile

From: "PostgreSQL Bugs List" <pgsql-bugs(at)postgresql(dot)org>
To: pgsql-bugs(at)postgresql(dot)org
Subject: BUG #1235: didn't compile
Date: 2004-08-27 13:13:08
Message-ID: 20040827131308.4A6745A109A@www.postgresql.com (view raw or flat)
Thread:
Lists: pgsql-bugs
The following bug has been logged online:

Bug reference:      1235
Logged by:          oliver artelt

Email address:      oli(at)cubeoffice(dot)de

PostgreSQL version: 8.0 Beta

Operating system:   Linux baldur 2.4.10 #1 SMP Wed Aug 7 13:37:21 CEST 2002 
i686 unknown 

Description:        didn't compile

Details: 

/configure --prefix /usr/local/pgsql-8.0.0beta1

make

..
syslogger.c: In function `SysLoggerMain':
syslogger.c:231: storage size of `timeout' isn't known
syslogger.c:231: warning: unused variable `timeout'
make[3]: *** [syslogger.o] Error 1
make[3]: Leaving directory 
`/usr/src/wrk/postgresql-8.0.0beta1/src/backend/postmaster' 
make[2]: *** [postmaster-recursive] Error 2
make[2]: Leaving directory `/usr/src/wrk/postgresql-8.0.0beta1/src/backend'
make[1]: *** [all] Error 2
make[1]: Leaving directory `/usr/src/wrk/postgresql-8.0.0beta1/src'
make: *** [all] Error 2
baldur:/usr/src/wrk/postgresql-8.0.0beta1 # uname -a
Linux baldur 2.4.10 #1 SMP Wed Aug 7 13:37:21 CEST 2002 i686 unknown
baldur:/usr/src/wrk/postgresql-8.0.0beta1 # gcc --version
2.95.2





Responses

pgsql-bugs by date

Next:From: Tom LaneDate: 2004-08-27 14:38:43
Subject: Re: BUG #1234: prepared statements and libpq don't work as expected
Previous:From: oaDate: 2004-08-27 13:09:21
Subject: Postgres 8.0.0beta1 didn't compile

Privacy Policy | About PostgreSQL
Copyright © 1996-2014 The PostgreSQL Global Development Group