Skip site navigation (1) Skip section navigation (2)

Build problem

From: "Douglas Wilson" <dgwilson1(at)cox(dot)net>
To: <pgsql-hackers-win32(at)postgresql(dot)org>
Subject: Build problem
Date: 2004-05-26 06:08:00
Message-ID: 000901c442e7$ccdd4bb0$6400a8c0@thing1 (view raw or flat)
Thread:
Lists: pgsql-hackers-win32
I tried to build the 5/24 and 5/25 snapshots (w/mingw and msys on XP), and
received the error below. I added a '#include limits.h' to oracle_compat.c,
and
it finished ok:

oracle_compat.c: In function `texttowcs':
oracle_compat.c:69: `INT_MAX' undeclared (first use in this function)
oracle_compat.c:69: (Each undeclared identifier is reported only once
oracle_compat.c:69: for each function it appears in.)
oracle_compat.c: In function `wcstotext':
oracle_compat.c:120: `INT_MAX' undeclared (first use in this function)
make[4]: *** [oracle_compat.o] Error 1
make[4]: Leaving directory `/c/Documents and Settings/Owner/My
Documents/Postgre
SQL/postgresql-snapshot/src/backend/utils/adt'
make[3]: *** [adt-recursive] Error 2
make[3]: Leaving directory `/c/Documents and Settings/Owner/My
Documents/Postgre
SQL/postgresql-snapshot/src/backend/utils'
make[2]: *** [utils-recursive] Error 2
make[2]: Leaving directory `/c/Documents and Settings/Owner/My
Documents/Postgre
SQL/postgresql-snapshot/src/backend'
make[1]: *** [install] Error 2
make[1]: Leaving directory `/c/Documents and Settings/Owner/My
Documents/Postgre
SQL/postgresql-snapshot/src'
make: *** [install] Error 2



pgsql-hackers-win32 by date

Next:From: Mark Cave-AylandDate: 2004-05-26 07:58:29
Subject: Win32 GiST bug - more info
Previous:From: Magnus HaganderDate: 2004-05-25 21:24:43
Subject: Re: another optimizer bug?

Privacy Policy | About PostgreSQL
Copyright © 1996-2014 The PostgreSQL Global Development Group