Skip site navigation (1) Skip section navigation (2)

Compilation fails --with-ssl on Solaris 8

From: Arcady Genkin <a(dot)genkin(at)utoronto(dot)ca>
To: Postgres-general <pgsql-general(at)postgresql(dot)org>, pgsql-bugs(at)postgresql(dot)org
Subject: Compilation fails --with-ssl on Solaris 8
Date: 2001-05-25 15:51:26
Message-ID: r1zpucx8m0x.fsf_-_@gnu.cdf.toronto.edu (view raw or flat)
Thread:
Lists: pgsql-bugspgsql-general
System:

 SunOS 5.8 Generic_108528-07 sun4u sparc SUNW,Ultra-Enterprise

Configuration options:

 env CFLAGS='-O2 -pipe' ./configure --prefix=/opt/pgsql \
       --with-perl --with-python --with-CXX \
       --with-openssl=/local/lib/openssl

Compilation fails with the following error:

In file included from crypt.c:27:
/usr/include/crypt.h:23: conflicting types for `des_encrypt'
/local/lib/openssl/include/openssl/des.h:150: previous declaration of `des_encrypt'
make[3]: *** [crypt.o] Error 1
make[3]: Leaving directory `/admin/src/postgresql-7.1.1/src/backend/libpq'
make[2]: *** [libpq-recursive] Error 2
make[2]: Leaving directory `/admin/src/postgresql-7.1.1/src/backend'
make[1]: *** [all] Error 2
make[1]: Leaving directory `/admin/src/postgresql-7.1.1/src'
make: *** [all] Error 2

-- 
Arcady Genkin

In response to

Responses

pgsql-bugs by date

Next:From: pgsql-bugsDate: 2001-05-25 17:22:40
Subject: Optimizer in 7.1.1 worse thatn 7.0.3
Previous:From: Jeff BoesDate: 2001-05-25 15:10:01
Subject: Re: COPY with default values?

pgsql-general by date

Next:From: Tim BarnardDate: 2001-05-25 16:05:50
Subject: Cursor question
Previous:From: Doug McNaughtDate: 2001-05-25 15:38:50
Subject: Re: Username with a hyphen character (grant failing?)

Privacy Policy | About PostgreSQL
Copyright © 1996-2014 The PostgreSQL Global Development Group