Skip site navigation (1) Skip section navigation (2)

Re: problems with regressive tests on rh8.0

From: "www(dot)mg(dot)te(dot)ua" <info(at)mg(dot)te(dot)ua>
To: Tom Lane <tgl(at)sss(dot)pgh(dot)pa(dot)us>
Cc: pgsql-admin(at)postgresql(dot)org
Subject: Re: problems with regressive tests on rh8.0
Date: 2004-02-23 08:52:17
Message-ID: 200402231052.17284.info@mg.te.ua (view raw or flat)
Thread:
Lists: pgsql-admin
Пон 23 Лют 2004 00:57, Tom Lane Ви написали:
> "www.mg.te.ua" <info(at)mg(dot)te(dot)ua> writes:
> > I have linux box under redhat linux 8.0 with original kernel 2.4.20
> > On this box I successfully build postgresql 7.3.4
> > After upgrading kernel to 2.4.24 i deside to upgrade postgresql.
> > I've  successfully built 7.4.1 was build without any difficulties, but
> > fail all of regressive test
>
> Fail how?  If you look at the regression diffs you may figure out what's
> wrong, but there's no way to guess on just this info.
>

!!!!! make:

All of PostgreSQL successfully made. Ready to install.

!!!!! make check:

[skipped]
/bin/sh ./pg_regress --temp-install --top-builddir=../../.. --schedule=./parallel_schedule --multibyte=SQL_ASCII
============== creating temporary installation        ==============

pg_regress: installation failed
Examine ./log/install.log for the reason.

make[2]: *** [check] Error 2
rm regress.o
make[2]: Leaving directory `/usr/src/pg-7.4.1/src/test/regress'
make[1]: *** [check] Error 2
make[1]: Leaving directory `/usr/src/pg-7.4.1/src/test'
make: *** [check] Error 2


!!!!!! cat install.log:

make[3]: Entering directory `/usr/src/pg-7.4.1'
make -C doc install
make[4]: Entering directory `/usr/src/pg-7.4.1/doc'
mkdir /usr/src/pg-7.4.1/src/test/regress/./tmp_check
mkdir /usr/src/pg-7.4.1/src/test/regress/./tmp_check/install
mkdir /usr/src/pg-7.4.1/src/test/regress/./tmp_check/install/usr
mkdir /usr/src/pg-7.4.1/src/test/regress/./tmp_check/install/usr/local
mkdir /usr/src/pg-7.4.1/src/test/regress/./tmp_check/install/usr/local/pgsql2
mkdir /usr/src/pg-7.4.1/src/test/regress/./tmp_check/install/usr/local/pgsql2/doc
mkdir /usr/src/pg-7.4.1/src/test/regress/./tmp_check/install/usr/local/pgsql2/doc/html
mkdir /usr/src/pg-7.4.1/src/test/regress/./tmp_check/install/usr/local/pgsql2/man
mkdir /usr/src/pg-7.4.1/src/test/regress/./tmp_check/install/usr/local/pgsql2/man/man1
mkdir /usr/src/pg-7.4.1/src/test/regress/./tmp_check/install/usr/local/pgsql2/man/man7
gzip -d -c ./postgres.tar.gz | ( cd /usr/src/pg-7.4.1/src/test/regress/./tmp_check/install/usr/local/pgsql2/doc/html && /bin/tar xf - )
/bin/tar: catalog-pg-trigger.html: Wrote only 0 of 10240 bytes
/bin/tar: Skipping to next header
/bin/tar: views-overview.html: Wrote only 0 of 10240 bytes
/bin/tar: Skipping to next header
/bin/tar: view-pg-rules.html: Wrote only 0 of 10240 bytes
/bin/tar: Skipping to next header
/bin/tar: view-pg-stats.html: Wrote only 0 of 10240 bytes
/bin/tar: Skipping to next header
/bin/tar: view-pg-user.html: Wrote only 0 of 10240 bytes
/bin/tar: protocol.html: Wrote only 0 of 10240 bytes
/bin/tar: Skipping to next header
/bin/tar: protocol-message-types.html: Wrote only 0 of 10240 bytes
/bin/tar: Skipping to next header
/bin/tar: protocol-error-fields.html: Wrote only 0 of 10240 bytes
/bin/tar: Skipping to next header
/bin/tar: source.html: Wrote only 0 of 10240 bytes
/bin/tar: Skipping to next header
/bin/tar: error-style-guide.html: Wrote only 0 of 10240 bytes
/bin/tar: Skipping to next header
/bin/tar: nls-programmer.html: Wrote only 0 of 10240 bytes
/bin/tar: Skipping to next header
/bin/tar: geqo.html: Wrote only 0 of 10240 bytes
/bin/tar: Skipping to next header
/bin/tar: Archive contains obsolescent base-64 headers
/bin/tar: geqo-pg-intro.html: Wrote only 0 of 10240 bytes
/bin/tar: Skipping to next header
/bin/tar: indexcost.html: Wrote only 0 of 10240 bytes
/bin/tar: Skipping to next header
/bin/tar: extensibility.html: Wrote only 0 of 10240 bytes
/bin/tar: Skipping to next header
/bin/tar: examples.html: Wrote only 0 of 10240 bytes
/bin/tar: Skipping to next header
/bin/tar: bki.html: Wrote only 0 of 10240 bytes
/bin/tar: Skipping to next header
/bin/tar: bki-example.html: Wrote only 0 of 10240 bytes
/bin/tar: Skipping to next header
/bin/tar: errcodes-appendix.html: Wrote only 0 of 10240 bytes
/bin/tar: Skipping to next header
/bin/tar: datetime-keywords.html: Wrote only 0 of 10240 bytes
/bin/tar: Skipping to next header
/bin/tar: sql-keywords-appendix.html: Wrote only 0 of 10240 bytes
/bin/tar: Skipping to next header
/bin/tar: unsupported-features-sql99.html: Wrote only 0 of 10240 bytes
/bin/tar: Skipping to next header
/bin/tar: release-7-4.html: Wrote only 0 of 10240 bytes
/bin/tar: Skipping to next header
/bin/tar: release-7-3-3.html: Wrote only 0 of 10240 bytes
/bin/tar: Skipping to next header
/bin/tar: release-7-3-1.html: Wrote only 0 of 10240 bytes
/bin/tar: Skipping to next header
/bin/tar: release-7-2-4.html: Wrote only 0 of 10240 bytes
/bin/tar: Skipping to next header
/bin/tar: release-7-2-2.html: Wrote only 0 of 10240 bytes
/bin/tar: Skipping to next header
/bin/tar: release-7-2.html: Wrote only 0 of 10240 bytes
/bin/tar: Skipping to next header
/bin/tar: release-7-1.html: Wrote only 0 of 10240 bytes
/bin/tar: Skipping to next header
/bin/tar: release-7-0-2.html: Wrote only 0 of 10240 bytes
/bin/tar: Skipping to next header
/bin/tar: release-7-0.html: Wrote only 0 of 10240 bytes
/bin/tar: Skipping to next header
/bin/tar: release-6-5-1.html: Wrote only 0 of 10240 bytes
/bin/tar: Skipping to next header
/bin/tar: release-6-4-2.html: Wrote only 0 of 10240 bytes
/bin/tar: Skipping to next header
/bin/tar: release-6-4.ht



In response to

Responses

pgsql-admin by date

Next:From: Kris ChapmanDate: 2004-02-23 11:58:58
Subject: 7.4.1 binary for RH9?
Previous:From: Leszek.DukwiczDate: 2004-02-23 08:16:47
Subject: FW: FW:

Privacy Policy | About PostgreSQL
Copyright © 1996-2014 The PostgreSQL Global Development Group